Reaction Details
TargetLysine-specific demethylase 2A
LigandBDBM276087
Substrate/Competitorn/a
Meas. Tech.FBXL11 Assay
Temperature298.15±n/a K
IC50<100±n/a nM
Commentsextracted
Citation Chen, YKNie, ZStafford, JAVeal, JM Histone demethylase inhibitors US Patent US10071984 Publication Date 9/11/2018
 
Lysine-specific demethylase 2A
Name:Lysine-specific demethylase 2A
Type:Enzyme Catalytic Domain
Mol. Mass.:132809.04
Organism:Homo sapiens (Human)
Description:n/a
Residue:1162
BDBM276087
NameBDBM276087
Synonyms:1-(4-chlorophenyl)-4-{1H-[1,2,3]triazolo[4,5-c]pyridin-6-yl}-1H-imidazole US10174003, Example 49 | US9896436, Example 49
TypeSmall organic molecule
Emp. Form.C14H9ClN6
Mol. Mass.296.714
SMILESClc1ccc(cc1)-n1cnc(c1)-c1cc2[nH]nnc2cn1