Reaction Details
TargetCannabinoid receptor 2
LigandBDBM22988
Substrate/Competitorn/a
Ki>10000±n/a nM
CommentsPDSP_301
Citation Griffin, GTao, QAbood, ME Cloning and pharmacological characterization of the rat CB(2) cannabinoid receptor. J Pharmacol Exp Ther292:886-94 (2000) Cannabinoid receptor 2
Name:Cannabinoid receptor 2
Type:Enzyme
Mol. Mass.:39366.68
Organism:Rattus norvegicus (Rat)
Description:Q9QZN9
Residue:360
BDBM22988
NameBDBM22988
Synonyms:(5Z,8Z,11Z,14Z)-N-(2-hydroxyethyl)icosa-5,8,11,14-tetraenamide ANANDAMIDE Arachidonoyl ethanolamide (AEA) Arachidonylethanolamide [14C]Anandamide | [3H]Anandamide
Typeradiolabeled substrate
Emp. Form.C22H37NO2
Mol. Mass.347.5347
SMILESCCCCC\C=C/C\C=C/C\C=C/C\C=C/CCCC(=O)NCCO