Reaction Details
TargetCannabinoid receptor 2
LigandBDBM21244
Substrate/Competitorn/a
Ki 0.88±n/a nM
CommentsPDSP_572
Citation Griffin, GTao, QAbood, ME Cloning and pharmacological characterization of the rat CB(2) cannabinoid receptor. J Pharmacol Exp Ther292:886-94 (2000) Cannabinoid receptor 2
Name:Cannabinoid receptor 2
Type:G Protein-Coupled Receptor (GPCR)
Mol. Mass.:39690.94
Organism:Homo sapiens (Human)
Description:P34972
Residue:360
BDBM21244
NameBDBM21244
Synonyms:2-[(1S,2S,5S)-5-hydroxy-2-(3-hydroxypropyl)cyclohexyl]-5-(2-methyloctan-2-yl)phenol CP 55,940 CP-56667 [(+)-AC],XV [3H]CP55940
Typeradiolabeled ligand
Emp. Form.C24H40O3
Mol. Mass.376.5726
SMILESCCCCCCC(C)(C)c1ccc([C@H]2C[C@@H](O)CC[C@@H]2CCCO)c(O)c1