Reaction Details
TargetCannabinoid receptor 2
LigandBDBM50330773
Substrate/Competitorn/a
Ki 0.72±n/a nM
CommentsPDSP_1008
Citation Griffin, GTao, QAbood, ME Cloning and pharmacological characterization of the rat CB(2) cannabinoid receptor. J Pharmacol Exp Ther292:886-94 (2000) Cannabinoid receptor 2
Name:Cannabinoid receptor 2
Type:Enzyme Catalytic Domain
Mol. Mass.:38220.43
Organism:MOUSE
Description:P47936
Residue:347
BDBM50330773
NameBDBM50330773
Synonyms:((6aR,10aR)-6,6-dimethyl-3-(2-methyloctan-2-yl)-6a,7,10,10a-tetrahydro-6H-benzo[c]chromen-9-yl)methanol JWH-051
TypeSmall organic molecule
Emp. Form.C25H38O2
Mol. Mass.370.568
SMILESCCCCCCC(C)(C)c1ccc2[C@@H]3CC(CO)=CC[C@H]3C(C)(C)Oc2c1