Reaction Details
TargetCannabinoid receptor 2
LigandBDBM50000729
Substrate/Competitorn/a
Ki 44.9±n/a nM
CommentsPDSP_1838
Citation Griffin, GTao, QAbood, ME Cloning and pharmacological characterization of the rat CB(2) cannabinoid receptor. J Pharmacol Exp Ther292:886-94 (2000) Cannabinoid receptor 2
Name:Cannabinoid receptor 2
Type:G Protein-Coupled Receptor (GPCR)
Mol. Mass.:39690.94
Organism:Homo sapiens (Human)
Description:P34972
Residue:360
BDBM50000729
NameBDBM50000729
Synonyms:(+)-6,6,9-Trimethyl-3-pentyl-6a,7,8,10a-tetrahydro-6H-benzo[c]chromen-1-ol 6,6,9-Trimethyl-3-pentyl-6a,7,8,10a-tetrahydro-6H-benzo[c]chromen-1-ol THC, delta 9 | Tetrahydrocannabinol
TypeSmall organic molecule
Emp. Form.C21H30O2
Mol. Mass.314.4617
SMILESCCCCCc1cc(O)c2C3C=C(C)CC[C@H]3C(C)(C)Oc2c1