Reaction Details
TargetNeuronal acetylcholine receptor subunit alpha-7
LigandBDBM50100712
Substrate/Competitorn/a
Ki 30±n/a nM
CommentsPDSP_982
Citation Mukhin, AGGündisch, DHorti, AGKoren, AOTamagnan, GKimes, ASChambers, JVaupel, DBKing, SLPicciotto, MRInnis, RBLondon, ED 5-Iodo-A-85380, an alpha4beta2 subtype-selective ligand for nicotinic acetylcholine receptors. Mol Pharmacol57:642-9 (2000) 
 
Neuronal acetylcholine receptor subunit alpha-7
Name:Neuronal acetylcholine receptor subunit alpha-7
Type:Enzyme
Mol. Mass.:56502.44
Organism:Rattus norvegicus (Rat)
Description:Q05941
Residue:502
BDBM50100712
NameBDBM50100712
Synonyms:2-(6-Iodo-pyridin-3-yl)-7-aza-bicyclo[2.2.1]heptane Epibatidine-I,(+/-) | IPH
TypeSmall organic molecule
Emp. Form.C11H13IN2
Mol. Mass.300.1388
SMILESIc1ccc(cn1)C1CC2CCC1N2