Reaction Details
TargetMuscarinic acetylcholine receptor M4
LigandBDBM86231
Substrate/Competitorn/a
Ki 0.3±n/a nM
CommentsPDSP_334
Citation Bymaster, FPFalcone, JF Decreased binding affinity of olanzapine and clozapine for human muscarinic receptors in intact clonal cells in physiological medium. Eur J Pharmacol390:245-8 (2000) 
 
Muscarinic acetylcholine receptor M4
Name:Muscarinic acetylcholine receptor M4
Type:Enzyme Catalytic Domain
Mol. Mass.:53079.31
Organism:Homo sapiens (Human)
Description:Cholinergic, muscarinic M4 CHRM4 HUMAN M3::P08173
Residue:479
BDBM86231
NameBDBM86231
Synonyms:ATR Atropine,(-) CHEMBL195 US9333195, ATROPINE
TypeSmall organic molecule
Emp. Form.C17H23NO3
Mol. Mass.289.3694
SMILESCN1C2CCC1CC(C2)OC(=O)C(CO)c1ccccc1