Reaction Details
TargetSodium-dependent dopamine transporter
LigandBDBM22416
Substrate/Competitorn/a
Ki 98±n/a nM
CommentsPDSP_1439
Citation Letchworth, SRSmith, HRPorrino, LJBennett, BADavies, HMSexton, TChilders, SR Characterization of a tropane radioligand, [(3)H]2beta-propanoyl-3beta-(4-tolyl) tropane ([(3)H]PTT), for dopamine transport sites in rat brain. J Pharmacol Exp Ther293:686-96 (2000) Sodium-dependent dopamine transporter
Name:Sodium-dependent dopamine transporter
Type:Multi-pass membrane protein
Mol. Mass.:68749.45
Organism:Rattus norvegicus (rat)
Description:P23977
Residue:619
BDBM22416
NameBDBM22416
Synonyms:(3S,4R)-3-[(1,3-benzodioxol-5-yloxy)methyl]-4-(4-fluorophenyl)piperidine CHEMBL490 US09969700, Paroxetine [3H]Paroxetine
Typeradiolabeled ligand
Emp. Form.C19H20FNO3
Mol. Mass.329.3654
SMILESFc1ccc(cc1)[C@@H]1CCNC[C@H]1COc1ccc2OCOc2c1