Reaction Details
TargetAdenosine receptor A3
LigandBDBM85618
Substrate/Competitorn/a
Ki 0.86±n/a nM
CommentsPDSP_2330
Citation Varani, KMerighi, SGessi, SKlotz, KNLeung, EBaraldi, PGCacciari, BRomagnoli, RSpalluto, GBorea, PA [(3)H]MRE 3008F20: a novel antagonist radioligand for the pharmacological and biochemical characterization of human A(3) adenosine receptors. Mol Pharmacol57:968-75 (2000) Adenosine receptor A3
Name:Adenosine receptor A3
Type:G Protein-Coupled Receptor (GPCR)
Mol. Mass.:36197.32
Organism:Homo sapiens (Human)
Description:P0DMS8
Residue:318
BDBM85618
NameBDBM85618
Synonyms:CHEMBL302765 MRE 3008F20
TypeSmall organic molecule
Emp. Form.C21H20N8O3
Mol. Mass.432.4353
SMILESCCCn1cc2c(n1)nc(NC(=O)Nc1ccc(OC)cc1)n1nc(nc21)-c1ccco1