Reaction Details
TargetCarbonic anhydrase 5A, mitochondrial
LigandBDBM10886
Substrate/Competitorn/a
Meas. Tech.CA Assay
pH7.4±0
Temperature293.15±0 K
Ki 36±0.0 nM
Citation Supuran, CTScozzafava, A Benzolamide is not a membrane-impermeant carbonic anhydrase inhibitor. J Enzyme Inhib Med Chem19:269-73 (2004) 
 
Carbonic anhydrase 5A, mitochondrial
Name:Carbonic anhydrase 5A, mitochondrial
Type:Enzyme
Mol. Mass.:34081.17
Organism:Mus musculus (mouse)
Description:Full length murine, cloned isozyme.
Residue:299
BDBM10886
NameBDBM10886
Synonyms:2-N-benzene-1,3,4-thiadiazole-2,5-disulfonamide Benzolamide CHEMBL73962
TypeSmall organic molecule
Emp. Form.C8H8N4O4S3
Mol. Mass.320.369
SMILESNS(=O)(=O)c1nnc(NS(=O)(=O)c2ccccc2)s1