Reaction Details
TargetCarbonic anhydrase 5A, mitochondrial
LigandBDBM85658
Substrate/Competitorn/a
Meas. Tech.CA Assay
pH7.4±0
Temperature293.15±0 K
Ki 47±0.0 nM
Citation Supuran, CTScozzafava, A Benzolamide is not a membrane-impermeant carbonic anhydrase inhibitor. J Enzyme Inhib Med Chem19:269-73 (2004) 
 
Carbonic anhydrase 5A, mitochondrial
Name:Carbonic anhydrase 5A, mitochondrial
Type:Enzyme
Mol. Mass.:34081.17
Organism:Mus musculus (mouse)
Description:Full length murine, cloned isozyme.
Residue:299
BDBM85658
NameBDBM85658
Synonyms:EZA4
TypeSmall organic molecule
Emp. Form.C10H10N2O3S
Mol. Mass.238.263
SMILESCCOc1ccc2nc(sc2c1)C(=O)ON