Reaction Details
TargetCannabinoid receptor 1
LigandBDBM21281
Substrate/Competitorn/a
Ki 25.7±n/a nM
CommentsPDSP_1966
Citation Soderstrom, KLeid, MMoore, FLMurray, TF Behaviroal, pharmacological, and molecular characterization of an amphibian cannabinoid receptor. J Neurochem75:413-23 (2000) 
 
Cannabinoid receptor 1
Name:Cannabinoid receptor 1
Type:Enzyme Catalytic Domain
Mol. Mass.:53332.86
Organism:Newt
Description:CANNABINOID CB1 CNR1 Newt::Q9PUI7
Residue:473
BDBM21281
NameBDBM21281
Synonyms:(11R)-2-methyl-11-(morpholin-4-ylmethyl)-3-(naphthalen-1-ylcarbonyl)-9-oxa-1-azatricyclo[6.3.1.0^{4,12}]dodeca-2,4(12),5,7-tetraene CHEMBL188 WIN 55212-2 WIN55212-2
TypeAnalgesic
Emp. Form.C27H26N2O3
Mol. Mass.426.5069
SMILESCc1c(C(=O)c2cccc3ccccc23)c2cccc3OC[C@@H](CN4CCOCC4)n1c23