Reaction Details
TargetHrh3 protein
LigandBDBM22541
Substrate/Competitorn/a
Ki 0.4±n/a nM
CommentsPDSP_539
Citation Lovenberg, TWPyati, JChang, HWilson, SJErlander, MG Cloning of rat histamine H(3) receptor reveals distinct species pharmacological profiles. J Pharmacol Exp Ther293:771-8 (2000) Hrh3 protein
Name:Hrh3 protein
Type:Enzyme Catalytic Domain
Mol. Mass.:37860.96
Organism:RAT
Description:Q5PPG3
Residue:344
BDBM22541
NameBDBM22541
Synonyms:Clobenpropit VUF 9153 VUF9153
TypeSmall organic molecule
Emp. Form.C14H17ClN4S
Mol. Mass.308.83
SMILESNC(SCCCc1cnc[nH]1)=NCc1ccc(Cl)cc1