Reaction Details
TargetRetinoic acid receptor RXR-alpha
LigandBDBM276121
Substrate/Competitorn/a
Meas. Tech.NR2B standard assay
pH7.4±n/a
Temperature298.15±n/a K
IC50 2.00±n/a nM
Commentsextracted
Citation Chen, GChrovian, CCCoate, HRDvorak, CAGelin, CFHiscox, ALetavic, MARech, JCSoyode-Johnson, AStenne, BWall, JLZhang, W Substituted 1,2,3-triazoles as NR2B-selective NMDA modulators US Patent US10071988 Publication Date 9/11/2018
 
Retinoic acid receptor RXR-alpha
Name:Retinoic acid receptor RXR-alpha
Type:PROTEIN
Mol. Mass.:50820.38
Organism:Homo sapiens (Human)
Description:ChEMBL_1456363
Residue:462
BDBM276121
NameBDBM276121
Synonyms:5-Chloro-2-[[1-[4-chloro-3-(difluoromethoxy)phenyl]triazol-4- US10233173, Example 28
TypeSmall organic molecule
Emp. Form.C14H9Cl2F2N5O2
Mol. Mass.388.156
SMILESFC(F)Oc1cc(ccc1Cl)-n1cc(COc2ncc(Cl)cn2)nn1