Reaction Details
TargetRetinoic acid receptor RXR-alpha
LigandBDBM276466
Substrate/Competitorn/a
Meas. Tech.NR2B standard assay
pH7.4±n/a
Temperature298.15±n/a K
IC50 3.00±n/a nM
Commentsextracted
Citation Chen, GChrovian, CCCoate, HRDvorak, CAGelin, CFHiscox, ALetavic, MARech, JCSoyode-Johnson, AStenne, BWall, JLZhang, W Substituted 1,2,3-triazoles as NR2B-selective NMDA modulators US Patent US10071988 Publication Date 9/11/2018
 
Retinoic acid receptor RXR-alpha
Name:Retinoic acid receptor RXR-alpha
Type:PROTEIN
Mol. Mass.:50820.38
Organism:Homo sapiens (Human)
Description:ChEMBL_1456363
Residue:462
BDBM276466
NameBDBM276466
Synonyms:5-(Difluoromethoxy)-2-[[1-[3-(difluoromethyl)-4-fluoro-phenyl]triazol- US10233173, Example 405
TypeSmall organic molecule
Emp. Form.C15H10F5N5O2
Mol. Mass.387.2642
SMILESFC(F)Oc1cnc(OCc2cn(nn2)-c2ccc(F)c(c2)C(F)F)nc1