Reaction Details
Target5-hydroxytryptamine receptor 1E
LigandBDBM50167898
Substrate/Competitorn/a
Ki>10000±n/a nM
CommentsPDSP_1676
Citation Reavill, CTaylor, SGWood, MDAshmeade, TAustin, NEAvenell, KYBoyfield, IBranch, CLCilia, JColdwell, MCHadley, MSHunter, AJJeffrey, PJewitt, FJohnson, CNJones, DNMedhurst, ADMiddlemiss, DNNash, DJRiley, GJRoutledge, CStemp, GThewlis, KMTrail, BVong, AKHagan, JJ Pharmacological actions of a novel, high-affinity, and selective human dopamine D(3) receptor antagonist, SB-277011-A. J Pharmacol Exp Ther294:1154-65 (2000) 5-hydroxytryptamine receptor 1E
Name:5-hydroxytryptamine receptor 1E
Type:G Protein-Coupled Receptor (GPCR)
Mol. Mass.:41697.80
Organism:Homo sapiens (Human)
Description:gi_112822
Residue:365
BDBM50167898
NameBDBM50167898
Synonyms:CHEMBL85606 N-(-4-(2-(6-cyano-3,4-dihydroisoquinolin-2(1H)-yl)ethyl)cyclohexyl)quinoline-4-carboxamide SB-277011 trans-N-[4-[2-(6-cyano-1,2,3,4-tetrahydroisoquinolin-2yl)-ethyl]cyclo-hexyl]-4-quinolinecarboxamide | trans-N-[4-[2-(6-cyano-1,2,3,4-tetrahydroisoquinolin-2yl)ethyl]-cyclohexyl]-4-quinolininecarboxamide
TypeSmall organic molecule
Emp. Form.C28H30N4O
Mol. Mass.438.564
SMILESO=C(NC1CC[C@H](CCN2CCc3cc(ccc3C2)C#N)CC1)c1ccnc2ccccc12