Reaction Details
Target5-hydroxytryptamine receptor 2C
LigandBDBM50040241
Substrate/Competitorn/a
Ki 56±n/a nM
CommentsPDSP_836
Citation Herrick-Davis, KGrinde, ETeitler, M Inverse agonist activity of atypical antipsychotic drugs at human 5-hydroxytryptamine2C receptors. J Pharmacol Exp Ther295:226-32 (2000) 5-hydroxytryptamine receptor 2C
Name:5-hydroxytryptamine receptor 2C
Type:G Protein-Coupled Receptor (GPCR)
Mol. Mass.:51836.79
Organism:Homo sapiens (Human)
Description:P28335
Residue:458
BDBM50040241
NameBDBM50040241
Synonyms:3-Fluoro-6-(4-methyl-piperazin-1-yl)-11H-dibenzo[b,e]azepine CHEMBL63756 | Fluperlapine
TypeSmall organic molecule
Emp. Form.C19H20FN3
Mol. Mass.309.3806
SMILESCN1CCN(CC1)C1=Nc2cc(F)ccc2Cc2ccccc12