Reaction Details
TargetGamma-aminobutyric acid receptor subunit alpha-2
LigandBDBM50045050
Substrate/Competitorn/a
Ki 41±n/a nM
CommentsPDSP_264
Citation Vanover, KERosenzweig-Lipson, SHawkinson, JELan, NCBelluzzi, JDStein, LBarrett, JEWood, PLCarter, RB Characterization of the anxiolytic properties of a novel neuroactive steroid, Co 2-6749 (GMA-839; WAY-141839; 3alpha, 21-dihydroxy-3beta-trifluoromethyl-19-nor-5beta-pregnan-20-one), a selective modulator of gamma-aminobutyric acid(A) receptors. J Pharmacol Exp Ther295:337-45 (2000) Gamma-aminobutyric acid receptor subunit alpha-2
Name:Gamma-aminobutyric acid receptor subunit alpha-2
Type:Enzyme
Mol. Mass.:51195.57
Organism:Rattus norvegicus (Rat)
Description:P23576
Residue:451
BDBM50045050
NameBDBM50045050
Synonyms:1-(3-Hydroxy-10,13-dimethyl-hexadecahydro-cyclopenta[a]phenanthren-17-yl)-ethanone CHEMBL435035
TypeSmall organic molecule
Emp. Form.C21H34O2
Mol. Mass.318.4935
SMILESCC(=O)C1CCC2C3CC[C@H]4C[C@H](O)CC[C@]4(C)C3CC[C@]12C