Reaction Details
TargetGamma-aminobutyric acid receptor subunit alpha-6
LigandBDBM50045050
Substrate/Competitorn/a
Ki 1100±n/a nM
CommentsPDSP_264
Citation Vanover, KERosenzweig-Lipson, SHawkinson, JELan, NCBelluzzi, JDStein, LBarrett, JEWood, PLCarter, RB Characterization of the anxiolytic properties of a novel neuroactive steroid, Co 2-6749 (GMA-839; WAY-141839; 3alpha, 21-dihydroxy-3beta-trifluoromethyl-19-nor-5beta-pregnan-20-one), a selective modulator of gamma-aminobutyric acid(A) receptors. J Pharmacol Exp Ther295:337-45 (2000) Gamma-aminobutyric acid receptor subunit alpha-6
Name:Gamma-aminobutyric acid receptor subunit alpha-6
Type:Enzyme Catalytic Domain
Mol. Mass.:51188.24
Organism:RAT
Description:GABA A Alpha6Beta2Gamma2 0 RAT::P30191
Residue:453
BDBM50045050
NameBDBM50045050
Synonyms:1-(3-Hydroxy-10,13-dimethyl-hexadecahydro-cyclopenta[a]phenanthren-17-yl)-ethanone CHEMBL435035
TypeSmall organic molecule
Emp. Form.C21H34O2
Mol. Mass.318.4935
SMILESCC(=O)C1CCC2C3CC[C@H]4C[C@H](O)CC[C@]4(C)C3CC[C@]12C