Reaction Details
TargetSodium-dependent dopamine transporter
LigandBDBM55121
Substrate/Competitorn/a
Ki 38.3±n/a nM
CommentsPDSP_728
Citation Rothman, RBBaumann, MHDersch, CMRomero, DVRice, KCCarroll, FIPartilla, JS Amphetamine-type central nervous system stimulants release norepinephrine more potently than they release dopamine and serotonin. Synapse39:32-41 (2001) 
 
Sodium-dependent dopamine transporter
Name:Sodium-dependent dopamine transporter
Type:Multi-pass membrane protein
Mol. Mass.:68749.45
Organism:Rattus norvegicus (rat)
Description:P23977
Residue:619
BDBM55121
NameBDBM55121
Synonyms:3-HYDROXYTYRAMINE HYDROCHLORIDE 4-(2-aminoethyl)pyrocatechol;hydrochloride Dopamine SMR000059081 | cid_65340
TypeSmall organic molecule
Emp. Form.C8H11NO2
Mol. Mass.153.1784
SMILESNCCc1ccc(O)c(O)c1