Reaction Details
TargetMetabotropic glutamate receptor 1
LigandBDBM85077
Substrate/Competitorn/a
Ki>10000±n/a nM
CommentsPDSP_2027
Citation Mutel, VEllis, GJAdam, GChaboz, SNilly, AMesser, JBleuel, ZMetzler, VMalherbe, PSchlaeger, EJRoughley, BSFaull, RLRichards, JG Characterization of [(3)H]Quisqualate binding to recombinant rat metabotropic glutamate 1a and 5a receptors and to rat and human brain sections. J Neurochem75:2590-601 (2000) 
 
Metabotropic glutamate receptor 1
Name:Metabotropic glutamate receptor 1
Type:Enzyme
Mol. Mass.:132358.19
Organism:Homo sapiens (Human)
Description:Q13255
Residue:1194
BDBM85077
NameBDBM85077
Synonyms:3-Phosphono-D,L-2-aminopropionic acid, 7 L-AP3 | NSC_3857
TypeSmall organic molecule
Emp. Form.C3H8NO5P
Mol. Mass.169.0731
SMILESNC(CP(O)(O)=O)C(O)=O