Reaction Details
TargetAlpha-2C adrenergic receptor
LigandBDBM50016897
Substrate/Competitorn/a
Ki 31.6228±n/a nM
CommentsPDSP_544
Citation Millan, MJDekeyne, ANewman-Tancredi, ACussac, DAudinot, VMilligan, GDuqueyroix, DGirardon, SMullot, JBoutin, JANicolas, JPRenouard-Try, ALacoste, JMCordi, A S18616, a highly potent, spiroimidazoline agonist at alpha(2)-adrenoceptors: I. Receptor profile, antinociceptive and hypothermic actions in comparison with dexmedetomidine and clonidine. J Pharmacol Exp Ther295:1192-205 (2000) Alpha-2C adrenergic receptor
Name:Alpha-2C adrenergic receptor
Type:Enzyme Catalytic Domain
Mol. Mass.:49890.50
Organism:RAT
Description:adrenergic Alpha2 0 RAT::P22086
Residue:458
BDBM50016897
NameBDBM50016897
Synonyms:2-(2,6-dichloroanilino)-1,3-diazacyclopentene-(2) CLONIDINE clonidine (amino form)
TypeSmall organic molecule
Emp. Form.C9H9Cl2N3
Mol. Mass.230.094
SMILESClc1cccc(Cl)c1\[#7]=[#6]-1\[#7]-[#6]-[#6]-[#7]-1