Reaction Details
TargetAlpha-2A adrenergic receptor
LigandBDBM85709
Substrate/Competitorn/a
Ki 0.631±n/a nM
CommentsPDSP_3303
Citation Millan, MJDekeyne, ANewman-Tancredi, ACussac, DAudinot, VMilligan, GDuqueyroix, DGirardon, SMullot, JBoutin, JANicolas, JPRenouard-Try, ALacoste, JMCordi, A S18616, a highly potent, spiroimidazoline agonist at alpha(2)-adrenoceptors: I. Receptor profile, antinociceptive and hypothermic actions in comparison with dexmedetomidine and clonidine. J Pharmacol Exp Ther295:1192-205 (2000) Alpha-2A adrenergic receptor
Name:Alpha-2A adrenergic receptor
Type:Enzyme
Mol. Mass.:48979.91
Organism:Homo sapiens (Human)
Description:P08913
Residue:450
BDBM85709
NameBDBM85709
Synonyms:S18616
TypeSmall organic molecule
Emp. Form.C12H14N2O
Mol. Mass.202.2524
SMILESNC1=NC2(CO1)CCc1ccccc1C2