Reaction Details
TargetProstaglandin F2-alpha receptor
LigandBDBM85339
Substrate/Competitorn/a
Ki 18±n/a nM
CommentsPDSP_1469
Citation Schuster, VLItoh, SAndrews, SWBurk, RMChen, JKedzie, KMGil, DWWoodward, DF Synthetic modification of prostaglandin f(2alpha) indicates different structural determinants for binding to the prostaglandin F receptor versus the prostaglandin transporter. Mol Pharmacol58:1511-6 (2000) 
 
Prostaglandin F2-alpha receptor
Name:Prostaglandin F2-alpha receptor
Type:Enzyme
Mol. Mass.:40072.29
Organism:Homo sapiens (Human)
Description:P43088
Residue:359
BDBM85339
NameBDBM85339
Synonyms:17-PHENYL TRINOR PGF2ALPHA-IPR PGF2Alpha,17-phenyl
TypeSmall organic molecule
Emp. Form.C26H38O5
Mol. Mass.430.5769
SMILESCC(C)OC(=O)CCC\C=C/C[C@H]1[C@@H](O)C[C@@H](O)[C@@H]1\C=C\[C@@H](O)CCc1ccccc1