Reaction Details
TargetSolute carrier organic anion transporter family member 2A1
LigandBDBM85716
Substrate/Competitorn/a
Ki>10000±n/a nM
CommentsPDSP_253
Citation Schuster, VLItoh, SAndrews, SWBurk, RMChen, JKedzie, KMGil, DWWoodward, DF Synthetic modification of prostaglandin f(2alpha) indicates different structural determinants for binding to the prostaglandin F receptor versus the prostaglandin transporter. Mol Pharmacol58:1511-6 (2000) 
 
Solute carrier organic anion transporter family member 2A1
Name:Solute carrier organic anion transporter family member 2A1
Type:Enzyme Catalytic Domain
Mol. Mass.:70068.67
Organism:Homo sapiens (Human)
Description:Prostaglandin Transporter 0 HUMAN::Q92959
Residue:643
BDBM85716
NameBDBM85716
Synonyms:AGN 191995
TypeSmall organic molecule
Emp. Form.C21H36O5
Mol. Mass.368.5075
SMILESCCCCC[C@@H](OC)\C=C\[C@H]1[C@H](O)C[C@H](O)[C@@H]1C\C=C\CCCC(O)=O