Reaction Details
Target5-hydroxytryptamine receptor 2B
LigandBDBM85530
Substrate/Competitorn/a
Ki 11.2±n/a nM
CommentsPDSP_1360
Citation Rothman, RBBaumann, MHSavage, JERauser, LMcBride, AHufeisen, SJRoth, BL Evidence for possible involvement of 5-HT(2B) receptors in the cardiac valvulopathy associated with fenfluramine and other serotonergic medications. Circulation102:2836-41 (2000) 
 
5-hydroxytryptamine receptor 2B
Name:5-hydroxytryptamine receptor 2B
Type:G Protein-Coupled Receptor (GPCR)
Mol. Mass.:54312.47
Organism:Homo sapiens (Human)
Description:Receptor binding assays were performed using human clone stably expressed in CHO cells.
Residue:481
BDBM85530
NameBDBM85530
Synonyms:Nor-d-fenfluramine Norfenfluramine Norfenfluramine (-) | d-Norfenfluramine
TypeSmall organic molecule
Emp. Form.C10H12F3N
Mol. Mass.203.2042
SMILESC[C@H](N)Cc1cccc(c1)C(F)(F)F