Reaction Details
TargetP2X purinoceptor 1
LigandBDBM85682
Substrate/Competitorn/a
Ki 1000±n/a nM
CommentsPDSP_3351
Citation Lambrecht, G Agonists and antagonists acting at P2X receptors: selectivity profiles and functional implications. Naunyn Schmiedebergs Arch Pharmacol362:340-50 (2000) 
 
P2X purinoceptor 1
Name:P2X purinoceptor 1
Type:Enzyme Catalytic Domain
Mol. Mass.:44969.95
Organism:RAT
Description:Purinergic, P2X1 0 RAT::P47824
Residue:399
BDBM85682
NameBDBM85682
Synonyms:CAS_5311315 NSC_5311315
TypeSmall organic molecule
Emp. Form.C49H30N6O23S6
Mol. Mass.1263.182
SMILES[O-]S(=O)(=O)c1cc(c2c(NC(=O)c3ccc(NC(=O)c4ccc(NC(=O)Nc5ccc(cc5)C(=O)Nc5ccc(cc5)C(=O)Nc5ccc(c6cc(cc(c56)S([O-])(=O)=O)S([O-])(=O)=O)S([O-])(=O)=O)cc4)cc3)ccc(c2c1)S([O-])(=O)=O)S([O-])(=O)=O