Reaction Details
TargetDelta-type opioid receptor
LigandBDBM50001465
Substrate/Competitorn/a
Ki 2.53±n/a nM
CommentsPDSP_2105
Citation Schiller, PWNguyen, TMBerezowska, IDupuis, SWeltrowska, GChung, NNLemieux, C Synthesis and in vitro opioid activity profiles of DALDA analogues. Eur J Med Chem35:895-901 (2000) 
 
Delta-type opioid receptor
Name:Delta-type opioid receptor
Type:Enzyme Catalytic Domain
Mol. Mass.:40577.25
Organism:MOUSE
Description:P32300
Residue:372
BDBM50001465
NameBDBM50001465
Synonyms:(S)-2-[(S)-2-(2-{2-[(S)-2-Amino-3-(4-hydroxy-phenyl)-propionylamino]-acetylamino}-acetylamino)-3-phenyl-propionylamino]-4-methyl-pentanoic acid (enkephalin)2-[2-(2-{2-[2-Amino-3-(4-hydroxy-phenyl)-propionylamino]-acetylamino}-acetylamino)-3-phenyl-propionylamino]-4-methyl-pentanoic acid 2-[(S)-2-(2-{2-[(S)-2-Amino-3-(4-hydroxy-phenyl)-propionylamino]-acetylamino}-acetylamino)-3-phenyl-propionylamino]-4-methyl-pentanoic acid 2-[2-(2-{2-[2-Amino-3-(4-hydroxy-phenyl)-propionylamino]-acetylamino}-acetylamino)-3-phenyl-propionylamino]-4-methyl-pentanoic acid 2-{1-[1-amino-2-(4-hydroxyphenyl)ethylcarboxamidomethylcarboxamidomethylcarboxamido]-2-phenylethylcarboxamido}-4-methylpentanoic acid ENKEPHALIN Leu5-Enkephalin | Tyr-Gly-Gly-Phe-Leu-OH
TypeSmall organic molecule
Emp. Form.C28H37N5O7
Mol. Mass.555.6227
SMILESCC(C)C[C@H](NC(=O)[C@H](Cc1ccccc1)NC(=O)CNC(=O)CNC(=O)[C@@H](N)Cc1ccc(O)cc1)C(O)=O