Reaction Details
Target5-hydroxytryptamine receptor 1A
LigandBDBM84994
Substrate/Competitorn/a
Ki 15±n/a nM
CommentsPDSP_1422
Citation Richelson, ESouder, T Binding of antipsychotic drugs to human brain receptors focus on newer generation compounds. Life Sci68:29-39 (2000) 
 
5-hydroxytryptamine receptor 1A
Name:5-hydroxytryptamine receptor 1A
Type:n/a
Mol. Mass.:46122.49
Organism:Homo sapiens (Human)
Description:n/a
Residue:422
BDBM84994
NameBDBM84994
Synonyms:CAS_163091 ORG-5222
TypeSmall organic molecule
Emp. Form.C17H16ClNO
Mol. Mass.285.768
SMILESCN1CC2C(C1)c1cc(Cl)ccc1Oc1ccccc21