Reaction Details
Target5-hydroxytryptamine receptor 1D
LigandBDBM84994
Substrate/Competitorn/a
Ki 10.2±n/a nM
CommentsPDSP_1422
Citation Richelson, ESouder, T Binding of antipsychotic drugs to human brain receptors focus on newer generation compounds. Life Sci68:29-39 (2000) 
 
5-hydroxytryptamine receptor 1D
Name:5-hydroxytryptamine receptor 1D
Type:G Protein-Coupled Receptor (GPCR)
Mol. Mass.:41920.63
Organism:Homo sapiens (Human)
Description:Receptor binding assays were performed using human clone stably expressed in CHO cells.
Residue:377
BDBM84994
NameBDBM84994
Synonyms:CAS_163091 ORG-5222
TypeSmall organic molecule
Emp. Form.C17H16ClNO
Mol. Mass.285.768
SMILESCN1CC2C(C1)c1cc(Cl)ccc1Oc1ccccc21