Reaction Details
TargetCannabinoid receptor 1
LigandBDBM85739
Substrate/Competitorn/a
Ki 1050±n/a nM
CommentsPDSP_1000
Citation Iwamura, HSuzuki, HUeda, YKaya, TInaba, T In vitro and in vivo pharmacological characterization of JTE-907, a novel selective ligand for cannabinoid CB2 receptor. J Pharmacol Exp Ther296:420-5 (2001) Cannabinoid receptor 1
Name:Cannabinoid receptor 1
Type:G Protein-Coupled Receptor (GPCR)
Mol. Mass.:52856.55
Organism:Rattus norvegicus (rat)
Description:P20272
Residue:473
BDBM85739
NameBDBM85739
Synonyms:CHEMBL178372 N-(1,3-Benzodioxole-5-ylmethyl)-2-oxo-7-methoxy-8-pentoxy-1,2-dihydro-3-quinolinecarboxamide
TypeSmall organic molecule
Emp. Form.C24H26N2O6
Mol. Mass.438.473
SMILESCCCCCOc1c(OC)ccc2cc(C(=O)NCc3ccc4OCOc4c3)c(=O)[nH]c12