Reaction Details
TargetGlutamate receptor 3
LigandBDBM17657
Substrate/Competitorn/a
Ki 89±n/a nM
CommentsPDSP_873
Citation Sakai, RSwanson, GTShimamoto, KGreen, TContractor, AGhetti, ATamura-Horikawa, YOiwa, CKamiya, H Pharmacological properties of the potent epileptogenic amino acid dysiherbaine, a novel glutamate receptor agonist isolated from the marine sponge Dysidea herbacea. J Pharmacol Exp Ther296:650-8 (2001) Glutamate receptor 3
Name:Glutamate receptor 3
Type:Enzyme Catalytic Domain
Mol. Mass.:100383.57
Organism:RAT
Description:Glutamate-AMPA GRIA3 RAT::P19492
Residue:888
BDBM17657
NameBDBM17657
Synonyms:(2S)-2-aminopentanedioic acid D-Glutamate L-Glu L-Glutamic acid L-gluatmate
TypeAmino Acid
Emp. Form.C5H9NO4
Mol. Mass.147.1293
SMILESN[C@@H](CCC(O)=O)C(O)=O