Reaction Details
TargetHistamine H4 receptor
LigandBDBM22883
Substrate/Competitorn/a
Ki 377±n/a nM
CommentsPDSP_671
Citation Liu, CMa, XJiang, XWilson, SJHofstra, CLBlevitt, JPyati, JLi, XChai, WCarruthers, NLovenberg, TW Cloning and pharmacological characterization of a fourth histamine receptor (H(4)) expressed in bone marrow. Mol Pharmacol59:420-6 (2001) 
 
Histamine H4 receptor
Name:Histamine H4 receptor
Type:G Protein-Coupled Receptor (GPCR)
Mol. Mass.:44517.02
Organism:Homo sapiens (Human)
Description:Binding assays were using CHO cells stably expressing hH4R receptors.
Residue:390
BDBM22883
NameBDBM22883
Synonyms:CHEMBL12344 [3-(carbamimidoylsulfanyl)propyl]dimethylamine
TypeSmall organic molecule
Emp. Form.C6H15N3S
Mol. Mass.161.268
SMILESCN(C)CCCSC(N)=N