Reaction Details
TargetHistamine H4 receptor
LigandBDBM22542
Substrate/Competitorn/a
Ki 9±n/a nM
CommentsPDSP_974
Citation Liu, CMa, XJiang, XWilson, SJHofstra, CLBlevitt, JPyati, JLi, XChai, WCarruthers, NLovenberg, TW Cloning and pharmacological characterization of a fourth histamine receptor (H(4)) expressed in bone marrow. Mol Pharmacol59:420-6 (2001) 
 
Histamine H4 receptor
Name:Histamine H4 receptor
Type:G Protein-Coupled Receptor (GPCR)
Mol. Mass.:44517.02
Organism:Homo sapiens (Human)
Description:Binding assays were using CHO cells stably expressing hH4R receptors.
Residue:390
BDBM22542
NameBDBM22542
Synonyms:4-(1H-imidazol-4-ylmethyl)piperidine Immepip
TypeSmall organic molecule
Emp. Form.C9H15N3
Mol. Mass.165.2355
SMILESC(C1CCNCC1)c1cnc[nH]1