Reaction Details
TargetHistamine H4 receptor
LigandBDBM7966
Substrate/Competitorn/a
Ki 17±n/a nM
CommentsPDSP_934
Citation Zhu, YMichalovich, DWu, HTan, KBDytko, GMMannan, IJBoyce, RAlston, JTierney, LALi, XHerrity, NCVawter, LSarau, HMAmes, RSDavenport, CMHieble, JPWilson, SBergsma, DJFitzgerald, LR Cloning, expression, and pharmacological characterization of a novel human histamine receptor. Mol Pharmacol59:434-41 (2001) 
 
Histamine H4 receptor
Name:Histamine H4 receptor
Type:G Protein-Coupled Receptor (GPCR)
Mol. Mass.:44517.02
Organism:Homo sapiens (Human)
Description:Binding assays were using CHO cells stably expressing hH4R receptors.
Residue:390
BDBM7966
NameBDBM7966
Synonyms:2-(1H-imidazol-4-yl)ethan-1-amine CHEMBL90 Ergotidine Histamine Peremin | [3H]histamine
TypeSmall organic molecule
Emp. Form.C5H9N3
Mol. Mass.111.1451
SMILESNCCc1cnc[nH]1