Reaction Details
TargetHistamine receptor H4
LigandBDBM7966
Substrate/Competitorn/a
Ki 104±n/a nM
CommentsPDSP_934
Citation Zhu, YMichalovich, DWu, HTan, KBDytko, GMMannan, IJBoyce, RAlston, JTierney, LALi, XHerrity, NCVawter, LSarau, HMAmes, RSDavenport, CMHieble, JPWilson, SBergsma, DJFitzgerald, LR Cloning, expression, and pharmacological characterization of a novel human histamine receptor. Mol Pharmacol59:434-41 (2001) 
 
Histamine receptor H4
Name:Histamine receptor H4
Type:Enzyme Catalytic Domain
Mol. Mass.:44536.99
Organism:GUINEA PIG
Description:HISTAMINE H4 HRH4 GUINEA PIG::Q91ZY3
Residue:389
BDBM7966
NameBDBM7966
Synonyms:2-(1H-imidazol-4-yl)ethan-1-amine CHEMBL90 Ergotidine Histamine Peremin | [3H]histamine
TypeSmall organic molecule
Emp. Form.C5H9N3
Mol. Mass.111.1451
SMILESNCCc1cnc[nH]1