Reaction Details
TargetHistamine receptor H4
LigandBDBM22904
Substrate/Competitorn/a
Ki 0.15±n/a nM
CommentsPDSP_1585
Citation Zhu, YMichalovich, DWu, HTan, KBDytko, GMMannan, IJBoyce, RAlston, JTierney, LALi, XHerrity, NCVawter, LSarau, HMAmes, RSDavenport, CMHieble, JPWilson, SBergsma, DJFitzgerald, LR Cloning, expression, and pharmacological characterization of a novel human histamine receptor. Mol Pharmacol59:434-41 (2001) 
 
Histamine receptor H4
Name:Histamine receptor H4
Type:Enzyme Catalytic Domain
Mol. Mass.:44536.99
Organism:GUINEA PIG
Description:HISTAMINE H4 HRH4 GUINEA PIG::Q91ZY3
Residue:389
BDBM22904
NameBDBM22904
Synonyms:(2R)-1-(1H-imidazol-5-yl)propan-2-amine Alpha-Methylhistamine-R CHEMBL268229 RAMH
TypeSmall organic molecule
Emp. Form.C6H11N3
Mol. Mass.125.1716
SMILESC[C@@H](N)Cc1cnc[nH]1