Reaction Details
TargetMu-type opioid receptor
LigandBDBM50087016
Substrate/Competitorn/a
Ki 12.9±n/a nM
CommentsPDSP_2072
Citation Hashiba, EHarrison, CGalo', GGuerrini, RRowbotham, DJSmith, GLambert, DG Characterisation and comparison of novel ligands for the nociceptin/orphanin FQ receptor. Naunyn Schmiedebergs Arch Pharmacol363:28-33 (2001) 
 
Mu-type opioid receptor
Name:Mu-type opioid receptor
Type:G Protein-Coupled Receptor (GPCR)
Mol. Mass.:44789.51
Organism:Homo sapiens (Human)
Description:P35372
Residue:400
BDBM50087016
NameBDBM50087016
Synonyms:8-Acenaphthen-1-yl-1-phenyl-1,3,8-triaza-spiro[4.5]decan-4-one Ro65-6570
TypeSmall organic molecule
Emp. Form.C25H25N3O
Mol. Mass.383.4855
SMILESO=C1NCN(c2ccccc2)C11CCN(CC1)C1Cc2cccc3cccc1c23