Reaction Details
TargetHistone deacetylase 1
LigandBDBM112876
Substrate/Competitorn/a
Meas. Tech.Fluorescence Detection
Temperature293.15±n/a K
IC50 0.47±0.07 nM
Commentsextracted
Citation Feng, ZCao, Z Hydroximic acid derivatives and medical applications therof US Patent US9695181 Publication Date 7/4/2017
 
Histone deacetylase 1
Name:Histone deacetylase 1
Type:Enzyme
Mol. Mass.:55090.27
Organism:Homo sapiens (Human)
Description:Q13547
Residue:482
BDBM112876
NameBDBM112876
Synonyms:US9695181, IIb
TypeSmall organic molecule
Emp. Form.C27H31FN8O3
Mol. Mass.534.5852
SMILESCc1ccc(F)c(NC(=O)Nc2ccc(cc2)-c2nn(CCCCCCCC(=O)NO)c3ncnc(N)c23)c1