Reaction Details
TargetXanthine dehydrogenase/oxidase
LigandBDBM85771
Substrate/Competitorn/a
Meas. Tech.Xanthine Oxidase Inhibition Assay
Ki 0.0475±0.03 nM
IC50 4.5e+2± 3e+1 nM
Citation Tamta, HThilagavathi, RChakraborti, AKMukhopadhyay, AK 6-(N-benzoylamino)purine as a novel and potent inhibitor of xanthine oxidase: inhibition mechanism and molecular modeling studies. J Enzyme Inhib Med Chem20:317-24 (2005) 
 
Xanthine dehydrogenase/oxidase
Name:Xanthine dehydrogenase/oxidase
Type:Enzyme
Mol. Mass.:146441.21
Organism:Homo sapiens (Human)
Description:P47989
Residue:1333
BDBM85771
NameBDBM85771
Synonyms:6-(N-benzoylamino)purine, 2
TypeSmall organic molecule
Emp. Form.C12H9N5O
Mol. Mass.239.2328
SMILESO=C(Nc1ncnc2nc[nH]c12)c1ccccc1