Reaction Details
TargetMuscarinic acetylcholine receptor M4
LigandBDBM82372
Substrate/Competitorn/a
Ki 0.66±n/a nM
CommentsPDSP_983
Citation Hirose, HAoki, IKimura, TFujikawa, TNumazawa, TSasaki, KSato, AHasegawa, TNishikibe, MMitsuya, MOhtake, NMase, TNoguchi, K Pharmacological properties of (2R)-N-[1-(6-aminopyridin-2-ylmethyl)piperidin-4-yl]-2-[(1R)-3,3-difluorocyclopentyl]-2-hydroxy-2-phenylacetamide: a novel mucarinic antagonist with M(2)-sparing antagonistic activity. J Pharmacol Exp Ther297:790-7 (2001) Muscarinic acetylcholine receptor M4
Name:Muscarinic acetylcholine receptor M4
Type:Enzyme Catalytic Domain
Mol. Mass.:53079.31
Organism:Homo sapiens (Human)
Description:Cholinergic, muscarinic M4 CHRM4 HUMAN M3::P08173
Residue:479
BDBM82372
NameBDBM82372
Synonyms:CAS_22254-24-6 NSC_3746
TypeSmall organic molecule
Emp. Form.C20H30NO3
Mol. Mass.332.4566
SMILESCC(C)[N+]1(C)C2CCC1CC(C2)OC(=O)C(CO)c1ccccc1