Reaction Details
TargetAlpha-2A adrenergic receptor
LigandBDBM30712
Substrate/Competitorn/a
Ki 4.9±n/a nM
CommentsPDSP_1428
Citation Naselsky, DPAshton, DRuffolo, RRHieble, JP Rabbit alpha2-adrenoceptors: both platelets and adipocytes have alpha2A-pharmacology. J Pharmacol Exp Ther298:219-25 (2001) Alpha-2A adrenergic receptor
Name:Alpha-2A adrenergic receptor
Type:Enzyme
Mol. Mass.:48979.91
Organism:Homo sapiens (Human)
Description:P08913
Residue:450
BDBM30712
NameBDBM30712
Synonyms:6-tert-butyl-3-(2-imidazolin-2-ylmethyl)-2,4-dimethyl-phenol;hydrochloride 6-tert-butyl-3-(4,5-dihydro-1H-imidazol-2-ylmethyl)-2,4-dimethylphenol;hydrochloride Oxymetazoline cid_66259
TypeSmall organic molecule
Emp. Form.C16H24N2O
Mol. Mass.260.3746
SMILESCc1cc(c(O)c(C)c1CC1=NCCN1)C(C)(C)C