Reaction Details
TargetAlpha-2A adrenergic receptor
LigandBDBM30993
Substrate/Competitorn/a
Ki 47.6±n/a nM
CommentsPDSP_1589
Citation Naselsky, DPAshton, DRuffolo, RRHieble, JP Rabbit alpha2-adrenoceptors: both platelets and adipocytes have alpha2A-pharmacology. J Pharmacol Exp Ther298:219-25 (2001) Alpha-2A adrenergic receptor
Name:Alpha-2A adrenergic receptor
Type:Enzyme
Mol. Mass.:48979.91
Organism:Homo sapiens (Human)
Description:P08913
Residue:450
BDBM30993
NameBDBM30993
Synonyms:Ajmalicine Raubasine cid_251561
TypeSmall organic molecule
Emp. Form.C21H24N2O3
Mol. Mass.352.4269
SMILESCOC(=O)C1=COC(C)C2CN3CCc4c([nH]c5ccccc45)C3CC12