Reaction Details
TargetAlpha-2A adrenergic receptor
LigandBDBM50019492
Substrate/Competitorn/a
Ki 0.92±n/a nM
CommentsPDSP_1648
Citation Naselsky, DPAshton, DRuffolo, RRHieble, JP Rabbit alpha2-adrenoceptors: both platelets and adipocytes have alpha2A-pharmacology. J Pharmacol Exp Ther298:219-25 (2001) Alpha-2A adrenergic receptor
Name:Alpha-2A adrenergic receptor
Type:Enzyme
Mol. Mass.:48979.91
Organism:Homo sapiens (Human)
Description:P08913
Residue:450
BDBM50019492
NameBDBM50019492
Synonyms:(+)2-(2-Methoxy-2,3-dihydro-benzo[1,4]dioxin-2-yl)-4,5-dihydro-1H-imidazole 2-(2,3-dihydro-2-methoxy-1,4-benzodioxin-2-yl)-4,5-dihydro-1H-imidazole 2-(2-methoxy-2,3-dihydrobenzo[b][1,4]dioxin-2-yl)-4,5-dihydro-1H-imidazole CHEMBL10332 RX821002
TypeSmall organic molecule
Emp. Form.C12H14N2O3
Mol. Mass.234.2512
SMILESCOC1(COc2ccccc2O1)C1=NCCN1