Reaction Details
TargetNeuropeptide Y receptor type 2
LigandBDBM85791
Substrate/Competitorn/a
Ki 1000±n/a nM
CommentsPDSP_1512
Citation Goumain, MVoisin, TLorinet, AMDucroc, RTsocas, ARozé, CRouet-Benzineb, PHerzog, HBalasubramaniam, ALaburthe, M The peptide YY-preferring receptor mediating inhibition of small intestinal secretion is a peripheral Y(2) receptor: pharmacological evidence and molecular cloning. Mol Pharmacol60:124-34 (2001) 
 
Neuropeptide Y receptor type 2
Name:Neuropeptide Y receptor type 2
Type:Enzyme Catalytic Domain
Mol. Mass.:42514.44
Organism:RAT
Description:NPY-Y2 NPY2R RAT::Q9ERC0
Residue:381
BDBM85791
NameBDBM85791
Synonyms:CAS_59763-91-6 PP, rat
TypeSmall organic molecule
Emp. Form.C31H24O3
Mol. Mass.444.5205
SMILESOc1c(C2CC(Cc3ccccc23)c2ccc(cc2)-c2ccccc2)c(=O)oc2ccccc12