Reaction Details
TargetNeuropeptide Y receptor type 2
LigandBDBM82420
Substrate/Competitorn/a
Ki 0.26±n/a nM
CommentsPDSP_1557
Citation Goumain, MVoisin, TLorinet, AMDucroc, RTsocas, ARozé, CRouet-Benzineb, PHerzog, HBalasubramaniam, ALaburthe, M The peptide YY-preferring receptor mediating inhibition of small intestinal secretion is a peripheral Y(2) receptor: pharmacological evidence and molecular cloning. Mol Pharmacol60:124-34 (2001) 
 
Neuropeptide Y receptor type 2
Name:Neuropeptide Y receptor type 2
Type:Enzyme Catalytic Domain
Mol. Mass.:42514.44
Organism:RAT
Description:NPY-Y2 NPY2R RAT::Q9ERC0
Residue:381
BDBM82420
NameBDBM82420
Synonyms:NPY, C2 PYY 3-36, porcine
TypeSmall organic molecule
Emp. Form.C96H160N32O23S2
Mol. Mass.2194.628
SMILESCC[C@H](C)[C@H](NC(=O)[C@@H](CS)NC(=O)[C@H](Cc1cnc[nH]1)NC(=O)[C@H](CCCN=C(N)N)NC(=O)CCCCCCCNC(=O)[C@@H](CCCCN)NC(=O)[C@@H](CO)NC(=O)[C@@H](CS)NC(=O)[C@H](N)Cc1ccc(O)cc1)C(=O)N[C@@H](CC(N)=O)C(=O)N[C@@H](CC(C)C)C(=O)N[C@@H]([C@H](C)CC)C(=O)N[C@@H]([C@@H](C)O)C(=O)N[C@@H](CCCN=C(N)N)C(=O)N[C@@H](CCC(N)=O)C(=O)N[C@@H](CCCN=C(N)N)C(=O)N[C@@H](Cc1ccc(O)cc1)C(N)=O