Reaction Details
TargetCannabinoid receptor 1
LigandBDBM85797
Substrate/Competitorn/a
Ki 137±n/a nM
CommentsPDSP_1397
Citation Breivogel, CSGriffin, GDi Marzo, VMartin, BR Evidence for a new G protein-coupled cannabinoid receptor in mouse brain. Mol Pharmacol60:155-63 (2001) Cannabinoid receptor 1
Name:Cannabinoid receptor 1
Type:G Protein-Coupled Receptor (GPCR)
Mol. Mass.:52856.55
Organism:Rattus norvegicus (rat)
Description:P20272
Residue:473
BDBM85797
NameBDBM85797
Synonyms:(5Z,8Z,11Z,14Z)-N-(1-Methyl-2-hydroxyethyl)-5,8,11,14-icosatetrenamide | O-610
TypeSmall organic molecule
Emp. Form.C23H39NO2
Mol. Mass.361.5613
SMILESCCCCC\C=C\C\C=C\C\C=C\C\C=C\CCCC(=O)NC(C)CO