Reaction Details
TargetDiacylglycerol O-acyltransferase 2
LigandBDBM276752
Substrate/Competitorn/a
Meas. Tech.In Vitro DGAT2 Assay
pH7.4±n/a
Temperature298.15±n/a K
IC50 13.5±n/a nM
Commentsextracted
Citation Boehm, MCabral, SDowling, MSFutatsugi, KHuard, KLee, ECLondregan, ATPolivkova, JPrice, DALi, Q Diacylglycerol acyl transferase 2 inhibitors US Patent US10071992 Publication Date 9/11/2018
 
Diacylglycerol O-acyltransferase 2
Name:Diacylglycerol O-acyltransferase 2
Type:Multi-pass membrane protein
Mol. Mass.:43848.90
Organism:Homo sapiens (Human)
Description:Q96PD7
Residue:388
BDBM276752
NameBDBM276752
Synonyms:2-(5-((3-ethoxypyridin- 2-yl)oxy)pyridin-3-yl)-N-(3- methyl-1,1-dioxidotetra- hydrothiophen-3-yl) pyrimidine-5-carboxamide US11034678, Example 3.1 WO2018033832, Ex. 3.1
TypeSmall organic molecule
Emp. Form.C22H23N5O5S
Mol. Mass.469.514
SMILESCCOc1cccnc1Oc1cncc(c1)-c1ncc(cn1)C(=O)NC1(C)CCS(=O)(=O)C1