Reaction Details
TargetDiacylglycerol O-acyltransferase 2
LigandBDBM276750
Substrate/Competitorn/a
Meas. Tech.In Vitro DGAT2 Assay
pH7.4±n/a
Temperature298.15±n/a K
IC50 181±n/a nM
Commentsextracted
Citation Boehm, MCabral, SDowling, MSFutatsugi, KHuard, KLee, ECLondregan, ATPolivkova, JPrice, DALi, Q Diacylglycerol acyl transferase 2 inhibitors US Patent US10071992 Publication Date 9/11/2018
 
Diacylglycerol O-acyltransferase 2
Name:Diacylglycerol O-acyltransferase 2
Type:Multi-pass membrane protein
Mol. Mass.:43848.90
Organism:Homo sapiens (Human)
Description:Q96PD7
Residue:388
BDBM276750
NameBDBM276750
Synonyms:(S)-2-(5-((3-ethoxypyridin-2-yl)oxy)pyridin-3-yl)-N-(tetrahydrofuran-3-yl)pyrimidine-5-carboxamide US10071992, Example 3.4 US11065249, WO2018033832-Ex.-1 | WO2018033832, Ex. 1
TypeSmall organic molecule
Emp. Form.C21H21N5O4
Mol. Mass.407.4225
SMILESCCOc1cccnc1Oc1cncc(c1)-c1ncc(cn1)C(=O)N[C@H]1CCOC1