Reaction Details
TargetProstaglandin-H2 D-isomerase
LigandBDBM50008805
Substrate/Competitorn/a
Ki 0.34±n/a nM
CommentsPDSP_2289
Citation Arimura, AYasui, KKishino, JAsanuma, FHasegawa, HKakudo, SOhtani, MArita, H Prevention of allergic inflammation by a novel prostaglandin receptor antagonist, S-5751. J Pharmacol Exp Ther298:411-9 (2001) Prostaglandin-H2 D-isomerase
Name:Prostaglandin-H2 D-isomerase
Type:Enzyme Catalytic Domain
Mol. Mass.:21031.11
Organism:Homo sapiens (Human)
Description:PGD2 0 HUMAN::P41222
Residue:190
BDBM50008805
NameBDBM50008805
Synonyms:7-(3-Benzenesulfonylamino-bicyclo[2.2.1]hept-2-yl)-hept-5-enoic acid S 145 | S-145,(+)
TypeSmall organic molecule
Emp. Form.C20H27NO4S
Mol. Mass.377.498
SMILESOC(=O)CCC\C=C/C[C@H]1[C@@H]2CCC(C2)C1NS(=O)(=O)c1ccccc1